Reaction Details
TargetDual specificity mitogen-activated protein kinase kinase 4
LigandBDBM5447
Substrate/Competitorn/a
Meas. Tech.ChEMBL_586988 (CHEMBL1062778)
Kd>10000±n/a nM
Citation Karaman, MWHerrgard, STreiber, DKGallant, PAtteridge, CECampbell, BTChan, KWCiceri, PDavis, MIEdeen, PTFaraoni, RFloyd, MHunt, JPLockhart, DJMilanov, ZVMorrison, MJPallares, GPatel, HKPritchard, SWodicka, LMZarrinkar, PP A quantitative analysis of kinase inhibitor selectivity. Nat Biotechnol26:127-32 (2008) 
 
Dual specificity mitogen-activated protein kinase kinase 4
Name:Dual specificity mitogen-activated protein kinase kinase 4
Type:PROTEIN
Mol. Mass.:44294.29
Organism:Homo sapiens (Human)
Description:ChEMBL_1460558
Residue:399
BDBM5447
NameBDBM5447
Synonyms:CHEMBL939 Iressa N-(3-chloro-4-fluorophenyl)-7-methoxy-6-[3-(morpholin-4-yl)propoxy]quinazolin-4-amine US10507209, Compound Gefitinib US9730934, Gefitinib WO2022090481, Example gefitinib cid_123631
TypeSmall organic molecule
Emp. Form.C22H24ClFN4O3
Mol. Mass.446.902
SMILESCOc1cc2ncnc(Nc3ccc(F)c(Cl)c3)c2cc1OCCCN1CCOCC1