Reaction Details
TargetCyclin-dependent kinase 8
LigandBDBM31340
Substrate/Competitorn/a
Meas. Tech.ChEMBL_587069 (CHEMBL1051283)
Kd 2300±n/a nM
Citation Karaman, MWHerrgard, STreiber, DKGallant, PAtteridge, CECampbell, BTChan, KWCiceri, PDavis, MIEdeen, PTFaraoni, RFloyd, MHunt, JPLockhart, DJMilanov, ZVMorrison, MJPallares, GPatel, HKPritchard, SWodicka, LMZarrinkar, PP A quantitative analysis of kinase inhibitor selectivity. Nat Biotechnol26:127-32 (2008) 
 
Cyclin-dependent kinase 8
Name:Cyclin-dependent kinase 8
Type:Serine/threonine-protein kinase
Mol. Mass.:53300.21
Organism:Homo sapiens (Human)
Description:P49336
Residue:464
BDBM31340
NameBDBM31340
Synonyms:2-methoxy-N-[(E)-3-[4-[3-methyl-4-(6-methylpyridin-3-yl)oxyanilino]quinazolin-6-yl]prop-2-enyl]acetamide 2-methoxy-N-[(E)-3-[4-[3-methyl-4-[(6-methyl-3-pyridyl)oxy]anilino]quinazolin-6-yl]allyl]acetamide CHEMBL483321 cid_9874913
TypeSmall organic molecule
Emp. Form.C27H27N5O3
Mol. Mass.469.535
SMILESCOCC(=O)NC\C=C\c1ccc2ncnc(Nc3ccc(Oc4ccc(C)nc4)c(C)c3)c2c1