Reaction Details
TargetTyrosine-protein kinase Tec
LigandBDBM26474
Substrate/Competitorn/a
Meas. Tech.ChEMBL_586363 (CHEMBL1061929)
Kd>10000±n/a nM
Citation Karaman, MWHerrgard, STreiber, DKGallant, PAtteridge, CECampbell, BTChan, KWCiceri, PDavis, MIEdeen, PTFaraoni, RFloyd, MHunt, JPLockhart, DJMilanov, ZVMorrison, MJPallares, GPatel, HKPritchard, SWodicka, LMZarrinkar, PP A quantitative analysis of kinase inhibitor selectivity. Nat Biotechnol26:127-32 (2008) 
 
Tyrosine-protein kinase Tec
Name:Tyrosine-protein kinase Tec
Type:Protein
Mol. Mass.:73597.00
Organism:Homo sapiens (Human)
Description:n/a
Residue:631
BDBM26474
NameBDBM26474
Synonyms:5-({4-[(2,3-dimethyl-2H-indazol-6-yl)(methyl)amino]pyrimidin-2-yl}amino)-2-methylbenzene-1-sulfonamide JMC514632 Compound 13 cid_10113978
TypeSmall organic molecule
Emp. Form.C21H23N7O2S
Mol. Mass.437.518
SMILESCN(c1ccc2c(C)n(C)nc2c1)c1ccnc(Nc2ccc(C)c(c2)S(N)(=O)=O)n1