Reaction Details
TargetTyrosine-protein kinase Fgr
LigandBDBM7533
Substrate/Competitorn/a
Meas. Tech.ChEMBL_586964 (CHEMBL1050840)
Kd>10000±n/a nM
Citation Karaman, MWHerrgard, STreiber, DKGallant, PAtteridge, CECampbell, BTChan, KWCiceri, PDavis, MIEdeen, PTFaraoni, RFloyd, MHunt, JPLockhart, DJMilanov, ZVMorrison, MJPallares, GPatel, HKPritchard, SWodicka, LMZarrinkar, PP A quantitative analysis of kinase inhibitor selectivity. Nat Biotechnol26:127-32 (2008) 
 
Tyrosine-protein kinase Fgr
Name:Tyrosine-protein kinase Fgr
Type:protein
Mol. Mass.:59469.88
Organism:Homo sapiens (Human)
Description:P09769
Residue:529
BDBM7533
NameBDBM7533
Synonyms:(2R)-2-[[6-(benzylamino)-9-isopropyl-purin-2-yl]amino]butan-1-ol (2R)-2-[[6-[(phenylmethyl)amino]-9-propan-2-yl-2-purinyl]amino]-1-butanol (2R)-2-{[6-(benzylamino)-9-(propan-2-yl)-9H-purin-2-yl]amino}butan-1-ol 2,6,9-Trisubstituted purine deriv. 28 CYC-202 cid_160355
TypeSmall organic molecule
Emp. Form.C19H26N6O
Mol. Mass.354.4493
SMILESCC[C@H](CO)Nc1nc(NCc2ccccc2)c2ncn(C(C)C)c2n1