Reaction Details
TargetEphrin type-A receptor 3
LigandBDBM21
Substrate/Competitorn/a
Meas. Tech.ChEMBL_586960 (CHEMBL1061145)
Kd 2000±n/a nM
Citation Karaman, MWHerrgard, STreiber, DKGallant, PAtteridge, CECampbell, BTChan, KWCiceri, PDavis, MIEdeen, PTFaraoni, RFloyd, MHunt, JPLockhart, DJMilanov, ZVMorrison, MJPallares, GPatel, HKPritchard, SWodicka, LMZarrinkar, PP A quantitative analysis of kinase inhibitor selectivity. Nat Biotechnol26:127-32 (2008) 
 
Ephrin type-A receptor 3
Name:Ephrin type-A receptor 3
Type:Protein
Mol. Mass.:110131.95
Organism:Homo sapiens (Human)
Description:P29320
Residue:983
BDBM21
NameBDBM21
Synonyms:CHEMBL24828 VANDETANIB ZD6474 | cid_3081361
Typen/a
Emp. Form.C22H24BrFN4O2
Mol. Mass.475.354
SMILESCOc1cc2c(Nc3ccc(Br)cc3F)ncnc2cc1OCC1CCN(C)CC1