Reaction Details
TargetEphrin type-A receptor 4
LigandBDBM21
Substrate/Competitorn/a
Meas. Tech.ChEMBL_586961 (CHEMBL1061895)
Kd 1600±n/a nM
Citation Karaman, MWHerrgard, STreiber, DKGallant, PAtteridge, CECampbell, BTChan, KWCiceri, PDavis, MIEdeen, PTFaraoni, RFloyd, MHunt, JPLockhart, DJMilanov, ZVMorrison, MJPallares, GPatel, HKPritchard, SWodicka, LMZarrinkar, PP A quantitative analysis of kinase inhibitor selectivity. Nat Biotechnol26:127-32 (2008) 
 
Ephrin type-A receptor 4
Name:Ephrin type-A receptor 4
Type:PROTEIN
Mol. Mass.:109859.29
Organism:Homo sapiens (Human)
Description:ChEMBL_586961
Residue:986
BDBM21
NameBDBM21
Synonyms:CHEMBL24828 VANDETANIB ZD6474 | cid_3081361
Typen/a
Emp. Form.C22H24BrFN4O2
Mol. Mass.475.354
SMILESCOc1cc2c(Nc3ccc(Br)cc3F)ncnc2cc1OCC1CCN(C)CC1