Reaction Details
TargetProto-oncogene tyrosine-protein kinase ROS
LigandBDBM5445
Substrate/Competitorn/a
Meas. Tech.ChEMBL_586358 (CHEMBL1061925)
Kd>10000±n/a nM
Citation Karaman, MWHerrgard, STreiber, DKGallant, PAtteridge, CECampbell, BTChan, KWCiceri, PDavis, MIEdeen, PTFaraoni, RFloyd, MHunt, JPLockhart, DJMilanov, ZVMorrison, MJPallares, GPatel, HKPritchard, SWodicka, LMZarrinkar, PP A quantitative analysis of kinase inhibitor selectivity. Nat Biotechnol26:127-32 (2008) 
 
Proto-oncogene tyrosine-protein kinase ROS
Name:Proto-oncogene tyrosine-protein kinase ROS
Type:Enzyme
Mol. Mass.:263897.39
Organism:Homo sapiens (Human)
Description:P08922
Residue:2347
BDBM5445
NameBDBM5445
Synonyms:CHEMBL554 LAPATINIB DITOSYLATE N-{3-chloro-4-[(3-fluoro-benzyl)oxy]phenyl}-6-[5-({2-(methylsulfonyl)ethyl]amino}methyl)-2-furyl]-4-quinazolinamine Tykerb US10822334, Compound Lapatinib cid_208908
TypeSmall organic molecule
Emp. Form.C29H26ClFN4O4S
Mol. Mass.581.058
SMILESCS(=O)(=O)CCNCc1ccc(o1)-c1ccc2ncnc(Nc3ccc(OCc4cccc(F)c4)c(Cl)c3)c2c1