Reaction Details
TargetCalcium/calmodulin-dependent protein kinase type 1G
LigandBDBM5445
Substrate/Competitorn/a
Meas. Tech.ChEMBL_586317 (CHEMBL1060178)
Kd>10000±n/a nM
Citation Karaman, MWHerrgard, STreiber, DKGallant, PAtteridge, CECampbell, BTChan, KWCiceri, PDavis, MIEdeen, PTFaraoni, RFloyd, MHunt, JPLockhart, DJMilanov, ZVMorrison, MJPallares, GPatel, HKPritchard, SWodicka, LMZarrinkar, PP A quantitative analysis of kinase inhibitor selectivity. Nat Biotechnol26:127-32 (2008) 
 
Calcium/calmodulin-dependent protein kinase type 1G
Name:Calcium/calmodulin-dependent protein kinase type 1G
Type:PROTEIN
Mol. Mass.:53096.44
Organism:Homo sapiens (Human)
Description:ChEMBL_774599
Residue:476
BDBM5445
NameBDBM5445
Synonyms:CHEMBL554 LAPATINIB DITOSYLATE N-{3-chloro-4-[(3-fluoro-benzyl)oxy]phenyl}-6-[5-({2-(methylsulfonyl)ethyl]amino}methyl)-2-furyl]-4-quinazolinamine Tykerb US10822334, Compound Lapatinib cid_208908
TypeSmall organic molecule
Emp. Form.C29H26ClFN4O4S
Mol. Mass.581.058
SMILESCS(=O)(=O)CCNCc1ccc(o1)-c1ccc2ncnc(Nc3ccc(OCc4cccc(F)c4)c(Cl)c3)c2c1