Reaction Details
TargetEphrin type-A receptor 5
LigandBDBM13535
Substrate/Competitorn/a
Meas. Tech.ChEMBL_586324 (CHEMBL1061069)
Kd>10000±n/a nM
Citation Karaman, MWHerrgard, STreiber, DKGallant, PAtteridge, CECampbell, BTChan, KWCiceri, PDavis, MIEdeen, PTFaraoni, RFloyd, MHunt, JPLockhart, DJMilanov, ZVMorrison, MJPallares, GPatel, HKPritchard, SWodicka, LMZarrinkar, PP A quantitative analysis of kinase inhibitor selectivity. Nat Biotechnol26:127-32 (2008) 
 
Ephrin type-A receptor 5
Name:Ephrin type-A receptor 5
Type:PROTEIN
Mol. Mass.:114807.59
Organism:Homo sapiens (Human)
Description:ChEMBL_774217
Residue:1037
BDBM13535
NameBDBM13535
Synonyms:4-[6-methoxy-7-(3-piperidin-1-ylpropoxy)quinazolin-4-yl]-N-(4-propan-2-yloxyphenyl)piperazine-1-carboxamide 4-[6-methoxy-7-[3-(1-piperidinyl)propoxy]-4-quinazolinyl]-N-(4-propan-2-yloxyphenyl)-1-piperazinecarboxamide CHEMBL124660 MLN518 cid_3038522
TypeSmall organic molecule
Emp. Form.C31H42N6O4
Mol. Mass.562.703
SMILESCOc1cc2c(ncnc2cc1OCCCN1CCCCC1)N1CCN(CC1)C(=O)Nc1ccc(OC(C)C)cc1