Reaction Details
TargetSRSF protein kinase 2
LigandBDBM21
Substrate/Competitorn/a
Meas. Tech.ChEMBL_586362 (CHEMBL1061928)
Kd>10000±n/a nM
Citation Karaman, MWHerrgard, STreiber, DKGallant, PAtteridge, CECampbell, BTChan, KWCiceri, PDavis, MIEdeen, PTFaraoni, RFloyd, MHunt, JPLockhart, DJMilanov, ZVMorrison, MJPallares, GPatel, HKPritchard, SWodicka, LMZarrinkar, PP A quantitative analysis of kinase inhibitor selectivity. Nat Biotechnol26:127-32 (2008) 
 
SRSF protein kinase 2
Name:SRSF protein kinase 2
Type:PROTEIN
Mol. Mass.:77488.98
Organism:Homo sapiens (Human)
Description:ChEMBL_774248
Residue:688
BDBM21
NameBDBM21
Synonyms:CHEMBL24828 VANDETANIB ZD6474 | cid_3081361
Typen/a
Emp. Form.C22H24BrFN4O2
Mol. Mass.475.354
SMILESCOc1cc2c(Nc3ccc(Br)cc3F)ncnc2cc1OCC1CCN(C)CC1