Reaction Details
TargetCarbonic anhydrase
LigandBDBM10879
Substrate/Competitorn/a
Meas. Tech.ChEMBL_587743 (CHEMBL1038579)
Ki 2510±n/a nM
Citation Bertucci, AInnocenti, AZoccola, DScozzafava, ATambutté, SSupuran, CT Carbonic anhydrase inhibitors. Inhibition studies of a coral secretory isoform by sulfonamides. Bioorg Med Chem17:5054-8 (2009) 
 
Carbonic anhydrase
Name:Carbonic anhydrase
Synonyms:Alpha carbonic anhydrase
Type:PROTEIN
Mol. Mass.:36650.57
Organism:Stylophora pistillata
Description:ChEMBL_700658
Residue:323
BDBM10879
NameBDBM10879
TypeSmall organic molecule
Emp. Form.C6H9N3O2S
Mol. Mass.187.22
SMILESNNc1ccccc1S(N)(=O)=O