Reaction Details
TargetP2Y purinoceptor 2
LigandBDBM50118213
Substrate/Competitorn/a
Meas. Tech.ChEMBL_587770 (CHEMBL1040421)
IC50 1510±n/a nM
Citation Sauer, REl-Tayeb, AKaulich, MMüller, CE Synthesis of uracil nucleotide analogs with a modified, acyclic ribose moiety as P2Y(2) receptor antagonists. Bioorg Med Chem17:5071-9 (2009) 
 
P2Y purinoceptor 2
Name:P2Y purinoceptor 2
Type:PROTEIN
Mol. Mass.:42202.78
Organism:Mus musculus
Description:ChEMBL_587770
Residue:373
BDBM50118213
NameBDBM50118213
Synonyms:5'-UTP H4utp uridine 5'-(tetrahydrogen triphosphate) | uridine 5'-triphosphoric acid
TypeSmall organic molecule
Emp. Form.C9H15N2O15P3
Mol. Mass.484.1411
SMILESO[C@@H]1[C@@H](COP(O)(=O)OP(O)(=O)OP(O)(O)=O)O[C@H]([C@@H]1O)n1ccc(=O)[nH]c1=O