Reaction Details
TargetCannabinoid receptor 2
LigandBDBM50298930
Substrate/Competitorn/a
Meas. Tech.ChEMBL_588142 (CHEMBL1049259)
Ki 739±n/a nM
Citation Silvestri, RLigresti, ALa Regina, GPiscitelli, FGatti, VBrizzi, APasquini, SLavecchia, AAllarà, MFantini, NCarai, MANovellino, EColombo, GDi Marzo, VCorelli, F Synthesis, cannabinoid receptor affinity, molecular modeling studies and in vivo pharmacological evaluation of new substituted 1-aryl-5-(1H-pyrrol-1-yl)-1H-pyrazole-3-carboxamides. 2. Effect of the 3-carboxamide substituent on the affinity and selectivity profile. Bioorg Med Chem17:5549-64 (2009) 
 
Cannabinoid receptor 2
Name:Cannabinoid receptor 2
Type:G Protein-Coupled Receptor (GPCR)
Mol. Mass.:39690.94
Organism:Homo sapiens (Human)
Description:P34972
Residue:360
BDBM50298930
NameBDBM50298930
Synonyms:CHEMBL573098 | N-(2-Bromo-3,4,5-trimethoxybenzyl)1-(2,4-difluorophenyl)-4-methyl-5-(1H-pyrrol-1-yl)-1H-pyrazole-3-carboxamide
TypeSmall organic molecule
Emp. Form.C25H23BrF2N4O4
Mol. Mass.561.375
SMILESCOc1cc(CNC(=O)c2nn(c(c2C)-n2cccc2)-c2ccc(F)cc2F)c(Br)c(OC)c1OC