Reaction Details
TargetCannabinoid receptor 1
LigandBDBM50298959
Substrate/Competitorn/a
Meas. Tech.ChEMBL_588141 (CHEMBL1049258)
Ki 84±n/a nM
Citation Silvestri, RLigresti, ALa Regina, GPiscitelli, FGatti, VBrizzi, APasquini, SLavecchia, AAllarà, MFantini, NCarai, MANovellino, EColombo, GDi Marzo, VCorelli, F Synthesis, cannabinoid receptor affinity, molecular modeling studies and in vivo pharmacological evaluation of new substituted 1-aryl-5-(1H-pyrrol-1-yl)-1H-pyrazole-3-carboxamides. 2. Effect of the 3-carboxamide substituent on the affinity and selectivity profile. Bioorg Med Chem17:5549-64 (2009) 
 
Cannabinoid receptor 1
Name:Cannabinoid receptor 1
Type:G Protein-Coupled Receptor (GPCR)
Mol. Mass.:52868.96
Organism:Homo sapiens (Human)
Description:P21554
Residue:472
BDBM50298959
NameBDBM50298959
Synonyms:CHEMBL579247 | N-Cyclopentyl-1-(2,4-dichlorophenyl)-4-methyl-5-(1Hpyrrol-1-yl)-1H-pyrazole-3-carboxamide
TypeSmall organic molecule
Emp. Form.C20H20Cl2N4O
Mol. Mass.403.305
SMILESCc1c(nn(c1-n1cccc1)-c1ccc(Cl)cc1Cl)C(=O)NC1CCCC1