Reaction Details
TargetInsulin-like growth factor 1 receptor
LigandBDBM50299144
Substrate/Competitorn/a
Meas. Tech.ChEMBL_591853 (CHEMBL1045057)
IC50 9±n/a nM
Citation Wittman, MDCarboni, JMYang, ZLee, FYAntman, MAttar, RBalimane, PChang, CChen, CDiscenza, LFrennesson, DGottardis, MMGreer, AHurlburt, WJohnson, WLangley, DRLi, ALi, JLiu, PMastalerz, HMathur, AMenard, KPatel, KSack, JSang, XSaulnier, MSmith, DStefanski, KTrainor, GVelaparthi, UZhang, GZimmermann, KVyas, DM Discovery of a 2,4-disubstituted pyrrolo[1,2-f][1,2,4]triazine inhibitor (BMS-754807) of insulin-like growth factor receptor (IGF-1R) kinase in clinical development. J Med Chem52:7360-3 (2009) 
 
Insulin-like growth factor 1 receptor
Name:Insulin-like growth factor 1 receptor
Type:Protein
Mol. Mass.:154776.79
Organism:Homo sapiens (Human)
Description:P08069
Residue:1367
BDBM50299144
NameBDBM50299144
Synonyms:(S)-1-(4-(5-cyclopropyl-1H-pyrazol-3-ylamino)pyrrolo[1,2-f][1,2,4]triazin-2-yl)-N-(pyridin-3-yl)pyrrolidine-2-carboxamide | CHEMBL573246
TypeSmall organic molecule
Emp. Form.C22H23N9O
Mol. Mass.429.4777
SMILESO=C(Nc1cccnc1)[C@@H]1CCCN1c1nc(Nc2cc([nH]n2)C2CC2)c2cccn2n1