Reaction Details
TargetVasopressin V1b receptor
LigandBDBM50299349
Substrate/Competitorn/a
Meas. Tech.ChEMBL_590268 (CHEMBL1052803)
Ki 23±n/a nM
Citation Scott, JDMiller, MWLi, SWLin, SIVaccaro, HAHong, LMullins, DEGuzzi, MWeinstein, JHodgson, RAVarty, GBStamford, AWChan, TYMcKittrick, BAGreenlee, WJPriestley, TParker, EM Tetrahydroquinoline sulfonamides as vasopressin 1b receptor antagonists. Bioorg Med Chem Lett19:6018-22 (2009) 
 
Vasopressin V1b receptor
Name:Vasopressin V1b receptor
Type:Enzyme Catalytic Domain
Mol. Mass.:47104.48
Organism:RAT
Description:VASOPRESSIN V1B AVPR1B RAT::P48974
Residue:425
BDBM50299349
NameBDBM50299349
Synonyms:1-(2-(1-(2,4-dimethoxyphenylsulfonyl)-1,2,3,4-tetrahydroquinolin-2-yl)ethylsulfonyl)-N-(thiophen-2-ylmethyl)piperidin-4-amine | CHEMBL583081
TypeSmall organic molecule
Emp. Form.C29H37N3O6S3
Mol. Mass.619.816
SMILESCOc1ccc(c(OC)c1)S(=O)(=O)N1C(CCS(=O)(=O)N2CCC(CC2)NCc2cccs2)CCc2ccccc12