Reaction Details
TargetVasopressin V1b receptor
LigandBDBM50299357
Substrate/Competitorn/a
Meas. Tech.ChEMBL_590268 (CHEMBL1052803)
Ki 227±n/a nM
Citation Scott, JDMiller, MWLi, SWLin, SIVaccaro, HAHong, LMullins, DEGuzzi, MWeinstein, JHodgson, RAVarty, GBStamford, AWChan, TYMcKittrick, BAGreenlee, WJPriestley, TParker, EM Tetrahydroquinoline sulfonamides as vasopressin 1b receptor antagonists. Bioorg Med Chem Lett19:6018-22 (2009) 
 
Vasopressin V1b receptor
Name:Vasopressin V1b receptor
Type:Enzyme Catalytic Domain
Mol. Mass.:47104.48
Organism:RAT
Description:VASOPRESSIN V1B AVPR1B RAT::P48974
Residue:425
BDBM50299357
NameBDBM50299357
Synonyms:1-(2-(1-(2,4-dimethoxyphenylsulfonyl)-1,2,3,4-tetrahydroquinolin-2-yl)ethylsulfonyl)-N-propylpiperidin-4-amine | CHEMBL575987
TypeSmall organic molecule
Emp. Form.C27H39N3O6S2
Mol. Mass.565.745
SMILESCCCNC1CCN(CC1)S(=O)(=O)CCC1CCc2ccccc2N1S(=O)(=O)c1ccc(OC)cc1OC