Reaction Details
TargetVasopressin V1b receptor
LigandBDBM50299340
Substrate/Competitorn/a
Meas. Tech.ChEMBL_590267 (CHEMBL1052802)
Ki 413±n/a nM
Citation Scott, JDMiller, MWLi, SWLin, SIVaccaro, HAHong, LMullins, DEGuzzi, MWeinstein, JHodgson, RAVarty, GBStamford, AWChan, TYMcKittrick, BAGreenlee, WJPriestley, TParker, EM Tetrahydroquinoline sulfonamides as vasopressin 1b receptor antagonists. Bioorg Med Chem Lett19:6018-22 (2009) 
 
Vasopressin V1b receptor
Name:Vasopressin V1b receptor
Type:Enzyme
Mol. Mass.:46985.01
Organism:Homo sapiens (Human)
Description:P47901
Residue:424
BDBM50299340
NameBDBM50299340
Synonyms:CHEMBL576341 | N-cyclobutyl-1-(2-(1-(2,4-dimethoxyphenylsulfonyl)-1,2,3,4-tetrahydroquinolin-2-yl)ethylsulfonyl)piperidin-4-amine
TypeSmall organic molecule
Emp. Form.C28H39N3O6S2
Mol. Mass.577.756
SMILESCOc1ccc(c(OC)c1)S(=O)(=O)N1C(CCS(=O)(=O)N2CCC(CC2)NC2CCC2)CCc2ccccc12