Reaction Details
TargetVasopressin V2 receptor
LigandBDBM50299343
Substrate/Competitorn/a
Meas. Tech.ChEMBL_590270 (CHEMBL1052805)
Ki 325±n/a nM
Citation Scott, JDMiller, MWLi, SWLin, SIVaccaro, HAHong, LMullins, DEGuzzi, MWeinstein, JHodgson, RAVarty, GBStamford, AWChan, TYMcKittrick, BAGreenlee, WJPriestley, TParker, EM Tetrahydroquinoline sulfonamides as vasopressin 1b receptor antagonists. Bioorg Med Chem Lett19:6018-22 (2009) 
 
Vasopressin V2 receptor
Name:Vasopressin V2 receptor
Type:Receptor
Mol. Mass.:40295.28
Organism:Homo sapiens (Human)
Description:P30518
Residue:371
BDBM50299343
NameBDBM50299343
Synonyms:(2S,4R)-1-((R)-5-chloro-1-(2,4-dimethoxyphenylsulfonyl)-3-(2-methoxyphenyl)-2-oxoindolin-3-yl)-4-hydroxy-N,N-dimethylpyrrolidine-2-carboxamide CHEMBL582857 SSR149415
TypeSmall organic molecule
Emp. Form.C30H32ClN3O8S
Mol. Mass.630.108
SMILESCOc1ccc(c(OC)c1)S(=O)(=O)N1C(=O)[C@@](N2C[C@H](O)C[C@H]2C(=O)N(C)C)(c2cc(Cl)ccc12)c1ccccc1OC