Reaction Details
TargetReceptor tyrosine-protein kinase erbB-2
LigandBDBM50299490
Substrate/Competitorn/a
Meas. Tech.ChEMBL_591075 (CHEMBL1052828)
IC50 21±n/a nM
Citation Gavai, AVFink, BEFairfax, DJMartin, GSRossiter, LMHolst, CLKim, SHLeavitt, KJMastalerz, HHan, WCNorris, DGoyal, BSwaminathan, SPatel, BMathur, AVyas, DMTokarski, JSYu, COppenheimer, SZhang, HMarathe, PFargnoli, JLee, FYWong, TWVite, GD Discovery and preclinical evaluation of [4-[[1-(3-fluorophenyl)methyl]-1H-indazol-5-ylamino]-5-methylpyrrolo[2,1-f][1,2,4]triazin-6-yl]carbamic acid, (3S)-3-morpholinylmethyl ester (BMS-599626), a selective and orally efficacious inhibitor of human epidermal growth factor receptor 1 and 2 kinases. J Med Chem52:6527-30 (2009) 
 
Receptor tyrosine-protein kinase erbB-2
Name:Receptor tyrosine-protein kinase erbB-2
Type:n/a
Mol. Mass.:137894.47
Organism:Homo sapiens (Human)
Description:P04626
Residue:1255
BDBM50299490
NameBDBM50299490
Synonyms:CHEMBL567873 | {4-(1-Benzyl-1H-indazol-5-ylamino)-5-ethyl-pyrrolo[2,1-f][1,2,4]triazin-6-yl}-carbamic acid,(3S)-3-morpholinylmethyl ester
TypeSmall organic molecule
Emp. Form.C28H30N8O3
Mol. Mass.526.5896
SMILESCCC1=C2C(N=C1NC(=O)OC[C@@H]1COCCN1)N=CN=C2Nc1ccc2n(Cc3ccccc3)ncc2c1