Reaction Details
TargetEpidermal growth factor receptor
LigandBDBM50333373
Substrate/Competitorn/a
Meas. Tech.ChEMBL_591074 (CHEMBL1052827)
IC50 32±n/a nM
Citation Gavai, AVFink, BEFairfax, DJMartin, GSRossiter, LMHolst, CLKim, SHLeavitt, KJMastalerz, HHan, WCNorris, DGoyal, BSwaminathan, SPatel, BMathur, AVyas, DMTokarski, JSYu, COppenheimer, SZhang, HMarathe, PFargnoli, JLee, FYWong, TWVite, GD Discovery and preclinical evaluation of [4-[[1-(3-fluorophenyl)methyl]-1H-indazol-5-ylamino]-5-methylpyrrolo[2,1-f][1,2,4]triazin-6-yl]carbamic acid, (3S)-3-morpholinylmethyl ester (BMS-599626), a selective and orally efficacious inhibitor of human epidermal growth factor receptor 1 and 2 kinases. J Med Chem52:6527-30 (2009) 
 
Epidermal growth factor receptor
Name:Epidermal growth factor receptor
Type:Receptor Kinase Domain
Mol. Mass.:134279.59
Organism:Homo sapiens (Human)
Description:P00533
Residue:1210
BDBM50333373
NameBDBM50333373
Synonyms:CHEMBL1645462 | [4-[[1-(3-fluorophenyl)methyl]-1H-indazol-5-ylamino]-5-methyl-pyrrolo[2,1-f][1,2,4]triazin-6-yl]-carbamic acid
TypeSmall organic molecule
Emp. Form.C27H27FN8O3
Mol. Mass.530.5535
SMILESCc1c(NC(=O)OC[C@@H]2COCCN2)cn2ncnc(Nc3ccc4n(Cc5cccc(F)c5)ncc4c3)c12