Reaction Details
TargetExtracellular calcium-sensing receptor
LigandBDBM50299546
Substrate/Competitorn/a
Meas. Tech.ChEMBL_591453 (CHEMBL1055305)
IC50 0.022000±n/a nM
Citation Marquis, RWLago, AMCallahan, JFRahman, ADong, XStroup, GBHoffman, SGowen, MDelMar, EGVan Wagenen, BCLogan, SShimizu, SFox, JNemeth, EFRoethke, TSmith, BRWard, KWBhatnagar, P Antagonists of the calcium receptor. 2. Amino alcohol-based parathyroid hormone secretagogues. J Med Chem52:6599-605 (2009) 
 
Extracellular calcium-sensing receptor
Name:Extracellular calcium-sensing receptor
Type:Protein
Mol. Mass.:120663.13
Organism:Homo sapiens (Human)
Description:P41180
Residue:1078
BDBM50299546
NameBDBM50299546
Synonyms:3-{3-Cyano-4-[((2R)-3-{[1,1-dimethyl-2-(2-naphthalenyl)ethyl]-amino}-2-hydroxypropyl)oxy]phenyl}propanoic Acid | CHEMBL570593
TypeSmall organic molecule
Emp. Form.C27H30N2O4
Mol. Mass.446.5381
SMILESCC(C)(Cc1ccc2ccccc2c1)NC[C@@H](O)COc1ccc(CCC(O)=O)cc1C#N