Reaction Details
TargetPotassium voltage-gated channel subfamily H member 2
LigandBDBM50175387
Substrate/Competitorn/a
Meas. Tech.ChEMBL_591458 (CHEMBL1052905)
IC50 3.2±n/a nM
Citation Marquis, RWLago, AMCallahan, JFRahman, ADong, XStroup, GBHoffman, SGowen, MDelMar, EGVan Wagenen, BCLogan, SShimizu, SFox, JNemeth, EFRoethke, TSmith, BRWard, KWBhatnagar, P Antagonists of the calcium receptor. 2. Amino alcohol-based parathyroid hormone secretagogues. J Med Chem52:6599-605 (2009) 
 
Potassium voltage-gated channel subfamily H member 2
Name:Potassium voltage-gated channel subfamily H member 2
Type:Multi-pass membrane protein
Mol. Mass.:126672.65
Organism:Homo sapiens (Human)
Description:Q12809
Residue:1159
BDBM50175387
NameBDBM50175387
Synonyms:(R)-2-(2-hydroxy-3-(2-methyl-1-(naphthalen-2-yl)propan-2-ylamino)propoxy)benzonitrile CHEMBL382741
TypeSmall organic molecule
Emp. Form.C24H26N2O2
Mol. Mass.374.4754
SMILESCC(C)(Cc1ccc2ccccc2c1)NC[C@@H](O)COc1ccccc1C#N