Reaction Details
TargetCytochrome P450 2D6
LigandBDBM50299545
Substrate/Competitorn/a
Meas. Tech.ChEMBL_591457 (CHEMBL1055309)
IC50 52±n/a nM
Citation Marquis, RWLago, AMCallahan, JFRahman, ADong, XStroup, GBHoffman, SGowen, MDelMar, EGVan Wagenen, BCLogan, SShimizu, SFox, JNemeth, EFRoethke, TSmith, BRWard, KWBhatnagar, P Antagonists of the calcium receptor. 2. Amino alcohol-based parathyroid hormone secretagogues. J Med Chem52:6599-605 (2009) 
 
Cytochrome P450 2D6
Name:Cytochrome P450 2D6
Type:Protein
Mol. Mass.:55774.82
Organism:Homo sapiens (Human)
Description:P10635
Residue:497
BDBM50299545
NameBDBM50299545
Synonyms:3-{4-[((2R)-3-{[1,1-Dimethyl-2-(2-naphthalenyl)ethyl]amino}-2-hydroxypropyl)oxy]phenyl}propanoic Acid | CHEMBL572163
TypeSmall organic molecule
Emp. Form.C26H31NO4
Mol. Mass.421.5286
SMILESCC(C)(Cc1ccc2ccccc2c1)NC[C@@H](O)COc1ccc(CCC(O)=O)cc1