Reaction Details
TargetSodium-dependent serotonin transporter
LigandBDBM50268077
Substrate/Competitorn/a
Meas. Tech.ChEMBL_591454 (CHEMBL1055306)
IC50 61.0±n/a nM
Citation Marquis, RWLago, AMCallahan, JFRahman, ADong, XStroup, GBHoffman, SGowen, MDelMar, EGVan Wagenen, BCLogan, SShimizu, SFox, JNemeth, EFRoethke, TSmith, BRWard, KWBhatnagar, P Antagonists of the calcium receptor. 2. Amino alcohol-based parathyroid hormone secretagogues. J Med Chem52:6599-605 (2009) 
 
Sodium-dependent serotonin transporter
Name:Sodium-dependent serotonin transporter
Type:Multi-pass membrane protein
Mol. Mass.:70322.51
Organism:Homo sapiens (Human)
Description:P31645
Residue:630
BDBM50268077
NameBDBM50268077
Synonyms:(S)-4-(2-hydroxy-3-(1-(4-methoxyphenyl)-2-methylpropan-2-ylamino)propoxy)-1H-benzo[d]imidazol-2(3H)-one | CHEMBL486278
TypeSmall organic molecule
Emp. Form.C21H27N3O4
Mol. Mass.385.4568
SMILESCOc1ccc(CC(C)(C)NC[C@H](O)COc2cccc3[nH]c(=O)[nH]c23)cc1