Reaction Details
TargetEstrogen receptor beta
LigandBDBM17289
Substrate/Competitorn/a
Meas. Tech.ChEMBL_591860 (CHEMBL1045064)
EC50 8±n/a nM
Citation Lilienkampf, AKarkola, SAlho-Richmond, SKoskimies, PJohansson, NHuhtinen, KVihko, KWähälä, K Synthesis and biological evaluation of 17beta-hydroxysteroid dehydrogenase type 1 (17beta-HSD1) inhibitors based on a thieno[2,3-d]pyrimidin-4(3H)-one core. J Med Chem52:6660-71 (2009) 
 
Estrogen receptor beta
Name:Estrogen receptor beta
Type:Protein
Mol. Mass.:59238.43
Organism:Homo sapiens (Human)
Description:Q92731
Residue:530
BDBM17289
NameBDBM17289
Synonyms:(1S,10R,11S,15S)-5-hydroxy-15-methyltetracyclo[8.7.0.0^{2,7}.0^{11,15}]heptadeca-2,4,6-trien-14-one Estrone Estrone, 15 Kestrone Unigen [2,4,6,7-3H]-Estrone | folliculin
TypeSteroid
Emp. Form.C18H22O2
Mol. Mass.270.3661
SMILES[H][C@@]12CCC(=O)[C@@]1(C)CC[C@]1([H])c3ccc(O)cc3CC[C@@]21[H]