Reaction Details
TargetCarbonic anhydrase 12
LigandBDBM10888
Substrate/Competitorn/a
Meas. Tech.ChEMBL_592387 (CHEMBL1036960)
Ki 11000±n/a nM
Citation Lopez, MPaul, BHofmann, AMorizzi, JWu, QKCharman, SAInnocenti, AVullo, DSupuran, CTPoulsen, SA S-glycosyl primary sulfonamides--a new structural class for selective inhibition of cancer-associated carbonic anhydrases. J Med Chem52:6421-32 (2009) 
 
Carbonic anhydrase 12
Name:Carbonic anhydrase 12
Type:Enzyme
Mol. Mass.:39456.00
Organism:Homo sapiens (Human)
Description:Catalytic domain of human cloned isozyme was used in the assay
Residue:354
BDBM10888
NameBDBM10888
Synonyms:1,2-benzoxazol-3-ylmethanesulfonamide SPR_2 Zonisamide Zonisamide (ZNS) Zonisamide, ZNS
TypeSmall organic molecule
Emp. Form.C8H8N2O3S
Mol. Mass.212.226
SMILESNS(=O)(=O)Cc1noc2ccccc12