Reaction Details
TargetCarbonic anhydrase 9
LigandBDBM50299578
Substrate/Competitorn/a
Meas. Tech.ChEMBL_592386 (CHEMBL1036959)
Ki 4050±n/a nM
Citation Lopez, MPaul, BHofmann, AMorizzi, JWu, QKCharman, SAInnocenti, AVullo, DSupuran, CTPoulsen, SA S-glycosyl primary sulfonamides--a new structural class for selective inhibition of cancer-associated carbonic anhydrases. J Med Chem52:6421-32 (2009) 
 
Carbonic anhydrase 9
Name:Carbonic anhydrase 9
Type:Enzyme
Mol. Mass.:49669.03
Organism:Homo sapiens (Human)
Description:Catalytic domain of human cloned isozyme was used in the assay
Residue:459
BDBM50299578
NameBDBM50299578
Synonyms:(2S,3R,4S,5S,6R)-3,4,5-trihydroxy-6-(hydroxymethyl)tetrahydro-2H-pyran-2-sulfonamide | CHEMBL569170
TypeSmall organic molecule
Emp. Form.C6H13NO7S
Mol. Mass.243.235
SMILESNS(=O)(=O)[C@@H]1O[C@H](CO)[C@@H](O)[C@H](O)[C@H]1O