Reaction Details
TargetCarbonic anhydrase 1
LigandBDBM50299581
Substrate/Competitorn/a
Meas. Tech.ChEMBL_592384 (CHEMBL1036957)
Ki 3970±n/a nM
Citation Lopez, MPaul, BHofmann, AMorizzi, JWu, QKCharman, SAInnocenti, AVullo, DSupuran, CTPoulsen, SA S-glycosyl primary sulfonamides--a new structural class for selective inhibition of cancer-associated carbonic anhydrases. J Med Chem52:6421-32 (2009) 
 
Carbonic anhydrase 1
Name:Carbonic anhydrase 1
Type:Enzyme
Mol. Mass.:28873.37
Organism:Homo sapiens (Human)
Description:P00915
Residue:261
BDBM50299581
NameBDBM50299581
Synonyms:(2S,3R,4R,5S,6R)-3,4-dihydroxy-6-(hydroxymethyl)-5-((2S,3R,4S,5R,6R)-3,4,5-trihydroxy-6-(hydroxymethyl)tetrahydro-2H-pyran-2-yloxy)tetrahydro-2H-pyran-2-sulfonamide | CHEMBL570125
TypeSmall organic molecule
Emp. Form.C12H23NO12S
Mol. Mass.405.376
SMILESNS(=O)(=O)[C@@H]1O[C@H](CO)[C@@H](O[C@@H]2O[C@H](CO)[C@H](O)[C@H](O)[C@H]2O)[C@H](O)[C@H]1O