Reaction Details
TargetCarbonic anhydrase 12
LigandBDBM50299582
Substrate/Competitorn/a
Meas. Tech.ChEMBL_592387 (CHEMBL1036960)
Ki 4840±n/a nM
Citation Lopez, MPaul, BHofmann, AMorizzi, JWu, QKCharman, SAInnocenti, AVullo, DSupuran, CTPoulsen, SA S-glycosyl primary sulfonamides--a new structural class for selective inhibition of cancer-associated carbonic anhydrases. J Med Chem52:6421-32 (2009) 
 
Carbonic anhydrase 12
Name:Carbonic anhydrase 12
Type:Enzyme
Mol. Mass.:39456.00
Organism:Homo sapiens (Human)
Description:Catalytic domain of human cloned isozyme was used in the assay
Residue:354
BDBM50299582
NameBDBM50299582
Synonyms:(2S,3R,4R,5S,6R)-3,4-dihydroxy-6-(hydroxymethyl)-5-((2R,3R,4S,5S,6R)-3,4,5-trihydroxy-6-(hydroxymethyl)tetrahydro-2H-pyran-2-yloxy)tetrahydro-2H-pyran-2-sulfonamide | CHEMBL569168
TypeSmall organic molecule
Emp. Form.C12H23NO12S
Mol. Mass.405.376
SMILESNS(=O)(=O)[C@@H]1O[C@H](CO)[C@@H](O[C@H]2O[C@H](CO)[C@@H](O)[C@H](O)[C@H]2O)[C@H](O)[C@H]1O