Reaction Details
TargetCarbonic anhydrase 2
LigandBDBM10875
Substrate/Competitorn/a
Meas. Tech.ChEMBL_588927 (CHEMBL1063842)
Ki 12±n/a nM
Citation Carta, FMaresca, ACovarrubias, ASMowbray, SLJones, TASupuran, CT Carbonic anhydrase inhibitors. Characterization and inhibition studies of the most active beta-carbonic anhydrase from Mycobacterium tuberculosis, Rv3588c. Bioorg Med Chem Lett19:6649-54 (2009) 
 
Carbonic anhydrase 2
Name:Carbonic anhydrase 2
Type:Enzyme
Mol. Mass.:29250.71
Organism:Homo sapiens (Human)
Description:P00918
Residue:260
BDBM10875
NameBDBM10875
Synonyms:5-(2-chlorophenyl)-1,3,4-thiadiazole-2-sulfonamide Chlorzolamide, CHL JMC523116 Compound 19 | aromatic/heteroaromatic sulfonamide 20
TypeSmall organic molecule
Emp. Form.C8H6ClN3O2S2
Mol. Mass.275.735
SMILESNS(=O)(=O)c1nnc(s1)-c1ccccc1Cl