Reaction Details
TargetCarbonic anhydrase 2
LigandBDBM11638
Substrate/Competitorn/a
Meas. Tech.ChEMBL_588927 (CHEMBL1063842)
Ki 40±n/a nM
Citation Carta, FMaresca, ACovarrubias, ASMowbray, SLJones, TASupuran, CT Carbonic anhydrase inhibitors. Characterization and inhibition studies of the most active beta-carbonic anhydrase from Mycobacterium tuberculosis, Rv3588c. Bioorg Med Chem Lett19:6649-54 (2009) 
 
Carbonic anhydrase 2
Name:Carbonic anhydrase 2
Type:Enzyme
Mol. Mass.:29250.71
Organism:Homo sapiens (Human)
Description:P00918
Residue:260
BDBM11638
NameBDBM11638
Synonyms:CHEMBL26 N-[(1-ethylpyrrolidin-2-yl)methyl]-2-methoxy-5-sulfamoylbenzamide SULPIRIDE,(-) Sulpiride, SLP US10172837, Sulpiride
TypeSmall organic molecule
Emp. Form.C15H23N3O4S
Mol. Mass.341.426
SMILESCCN1CCCC1CNC(=O)c1cc(ccc1OC)S(N)(=O)=O