Reaction Details
TargetLegumain
LigandBDBM50378274
Substrate/Competitorn/a
Meas. Tech.ChEMBL_589116 (CHEMBL1038469)
IC50 0.14±n/a nM
Citation Ovat, AMuindi, FFagan, CBrouner, MHansell, EDvorák, JSojka, DKopácek, PMcKerrow, JHCaffrey, CRPowers, JC Aza-peptidyl Michael acceptor and epoxide inhibitors--potent and selective inhibitors of Schistosoma mansoni and Ixodes ricinus legumains (asparaginyl endopeptidases). J Med Chem52:7192-210 (2009) 
 
Legumain
Name:Legumain
Type:Enzyme
Mol. Mass.:49038.15
Organism:Ixodes ricinus
Description:IrAE was expressed and produced in Pichia pastoris.
Residue:441
BDBM50378274
NameBDBM50378274
Synonyms:CHEMBL573437
TypeSmall organic molecule
Emp. Form.C27H37N7O9
Mol. Mass.603.6242
SMILESCCOC(=O)C=CC(=O)N(CC(N)=O)NC(=O)[C@H](C)NC(=O)[C@@H](C)NC(=O)N1CCN(CC1)C(=O)OCc1ccccc1