Reaction Details
TargetLegumain
LigandBDBM50378276
Substrate/Competitorn/a
Meas. Tech.ChEMBL_589116 (CHEMBL1038469)
IC50 0.37±n/a nM
Citation Ovat, AMuindi, FFagan, CBrouner, MHansell, EDvorák, JSojka, DKopácek, PMcKerrow, JHCaffrey, CRPowers, JC Aza-peptidyl Michael acceptor and epoxide inhibitors--potent and selective inhibitors of Schistosoma mansoni and Ixodes ricinus legumains (asparaginyl endopeptidases). J Med Chem52:7192-210 (2009) 
 
Legumain
Name:Legumain
Type:Enzyme
Mol. Mass.:49038.15
Organism:Ixodes ricinus
Description:IrAE was expressed and produced in Pichia pastoris.
Residue:441
BDBM50378276
NameBDBM50378276
Synonyms:CHEMBL582898
TypeSmall organic molecule
Emp. Form.C47H50N8O8
Mol. Mass.854.9487
SMILESC[C@@H](NC(=O)N1CCN(CC1)C(=O)OCc1ccccc1)C(=O)N[C@@H](C)C(=O)NN(CC(N)=O)C(=O)C=CC(=O)N(Cc1cccc2ccccc12)Cc1cccc2ccccc12