Reaction Details
TargetLegumain
LigandBDBM50378287
Substrate/Competitorn/a
Meas. Tech.ChEMBL_589116 (CHEMBL1038469)
IC50 6±n/a nM
Citation Ovat, AMuindi, FFagan, CBrouner, MHansell, EDvorák, JSojka, DKopácek, PMcKerrow, JHCaffrey, CRPowers, JC Aza-peptidyl Michael acceptor and epoxide inhibitors--potent and selective inhibitors of Schistosoma mansoni and Ixodes ricinus legumains (asparaginyl endopeptidases). J Med Chem52:7192-210 (2009) 
 
Legumain
Name:Legumain
Type:Enzyme
Mol. Mass.:49038.15
Organism:Ixodes ricinus
Description:IrAE was expressed and produced in Pichia pastoris.
Residue:441
BDBM50378287
NameBDBM50378287
Synonyms:CHEMBL584154
TypeSmall organic molecule
Emp. Form.C28H35N7O8
Mol. Mass.597.6196
SMILESC[C@@H](NC(=O)N1CCOCC1)C(=O)N[C@@H](C)C(=O)NN(CC(N)=O)C(=O)[C@H]1O[C@@H]1C(=O)NCc1cccc2ccccc12