Reaction Details
TargetCyclin-dependent kinase 2/G1/S-specific cyclin-E1/G1/S-specific cyclin-E2
LigandBDBM50378304
Substrate/Competitorn/a
Meas. Tech.ChEMBL_589413 (CHEMBL1058434)
IC50<0.03±n/a nM
Citation Trova, MPBarnes, KDAlicea, LBenanti, TBielaska, MBilotta, JBliss, BDuong, TNHaydar, SHerr, RJHui, YJohnson, MLehman, JMPeace, DRainka, MSnider, PSalamone, STregay, SZheng, XFriedrich, TD Heterobiaryl purine derivatives as potent antiproliferative agents: inhibitors of cyclin dependent kinases. Part II. Bioorg Med Chem Lett19:6613-7 (2009) 
 
Cyclin-dependent kinase 2/G1/S-specific cyclin-E1/G1/S-specific cyclin-E2
Name:Cyclin-dependent kinase 2/G1/S-specific cyclin-E1/G1/S-specific cyclin-E2
Type:n/a
Mol. Mass.:n/a
Description:ASSAY_ID of EBI is 52510
Components:This complex has 3 components.
Component 1
Name:G1/S-specific cyclin-E2
Synonyms:CCNE2 CDK3/cyclin E | G1/S-specific cyclin-E2
Type:PROTEIN
Mol. Mass.:46763.82
Organism:Homo sapiens (Human)
Description:EBI_10135
Residue:404
Component 2
Name:Cyclin-dependent kinase 2
Synonyms:CDK2 CDK2_HUMAN Cell division protein kinase 2 Protein cereblon/Cyclin-dependent kinase 2 | p33 protein kinase
Type:Enzyme Subunit
Mol. Mass.:33938.17
Organism:Homo sapiens (Human)
Description:P24941
Residue:298
Component 3
Name:G1/S-specific cyclin-E1
Synonyms:CCNE CCNE1_HUMAN
Type:Enzyme Subunit
Mol. Mass.:47073.17
Organism:Homo sapiens (Human)
Description:n/a
Residue:410
BDBM50378304
NameBDBM50378304
Synonyms:CHEMBL568080
TypeSmall organic molecule
Emp. Form.C24H30N8S
Mol. Mass.462.614
SMILESCC(C)n1cnc2c(NCc3ccc(nc3)-c3ccsc3)nc(N[C@H]3CC[C@H](N)CC3)nc12