Reaction Details
TargetCyclin-A1/Cyclin-A2/Cyclin-dependent kinase 2
LigandBDBM50378314
Substrate/Competitorn/a
Meas. Tech.ChEMBL_589414 (CHEMBL1058435)
IC50 0.60±n/a nM
Citation Trova, MPBarnes, KDAlicea, LBenanti, TBielaska, MBilotta, JBliss, BDuong, TNHaydar, SHerr, RJHui, YJohnson, MLehman, JMPeace, DRainka, MSnider, PSalamone, STregay, SZheng, XFriedrich, TD Heterobiaryl purine derivatives as potent antiproliferative agents: inhibitors of cyclin dependent kinases. Part II. Bioorg Med Chem Lett19:6613-7 (2009) 
 
Cyclin-A1/Cyclin-A2/Cyclin-dependent kinase 2
Name:Cyclin-A1/Cyclin-A2/Cyclin-dependent kinase 2
Type:n/a
Mol. Mass.:n/a
Description:ASSAY_ID of EBI is 42813
Components:This complex has 3 components.
Component 1
Name:Cyclin-A2
Synonyms:CCN1 CCNA1 CCNA2_HUMAN Cyclin-A
Type:Enzyme Subunit
Mol. Mass.:48550.19
Organism:Homo sapiens (Human)
Description:P20248
Residue:432
Component 2
Name:Cyclin-A1
Synonyms:CCNA1 CDK2/Cyclin A1 Cyclin-A1/Cyclin-dependent kinase 4
Type:Enzyme
Mol. Mass.:52343.37
Organism:Homo sapiens (Human)
Description:P78396
Residue:465
Component 3
Name:Cyclin-dependent kinase 2
Synonyms:CDK2 CDK2_HUMAN Cell division protein kinase 2 Protein cereblon/Cyclin-dependent kinase 2 | p33 protein kinase
Type:Enzyme Subunit
Mol. Mass.:33938.17
Organism:Homo sapiens (Human)
Description:P24941
Residue:298
Component 4
Name:Cyclin-A2
Synonyms:CCN1 CCNA1 CCNA2_HUMAN Cyclin-A
Type:Enzyme Subunit
Mol. Mass.:48550.19
Organism:Homo sapiens (Human)
Description:P20248
Residue:432
BDBM50378314
NameBDBM50378314
Synonyms:CHEMBL578256
TypeSmall organic molecule
Emp. Form.C23H29N7OS
Mol. Mass.451.588
SMILESCC(C)n1cnc2c(NCc3ccc(s3)-c3ccoc3)nc(N[C@H]3CC[C@H](N)CC3)nc12