Reaction Details
TargetGlycogen synthase kinase-3 beta
LigandBDBM7265
Substrate/Competitorn/a
Meas. Tech.ChEMBL_593419 (CHEMBL1040547)
IC50 18±n/a nM
Citation Becker, AKohfeld, SLader, APreu, LPies, TWieking, KFerandin, YKnockaert, MMeijer, LKunick, C Development of 5-benzylpaullones and paullone-9-carboxylic acid alkyl esters as selective inhibitors of mitochondrial malate dehydrogenase (mMDH). Eur J Med Chem45:335-42 (2010) 
 
Glycogen synthase kinase-3 beta
Name:Glycogen synthase kinase-3 beta
Type:Enzyme
Mol. Mass.:46756.38
Organism:Homo sapiens (Human)
Description:P49841
Residue:420
BDBM7265
NameBDBM7265
Synonyms:4,5-dimethoxy-9-oxo-8,18-diazatetracyclo[9.7.0.0^{2,7}.0^{12,17}]octadeca-1(11),2,4,6,12(17),13,15-heptaene-14-carbonitrile NSC 708244 | Paullone Analog 4
TypeSmall organic molecule
Emp. Form.C19H15N3O3
Mol. Mass.333.3407
SMILESCOc1cc2NC(=O)Cc3c([nH]c4ccc(cc34)C#N)-c2cc1OC