Reaction Details
TargetMalate dehydrogenase, mitochondrial
LigandBDBM50300046
Substrate/Competitorn/a
Meas. Tech.ChEMBL_593431 (CHEMBL1041437)
IC50 4400±n/a nM
Citation Becker, AKohfeld, SLader, APreu, LPies, TWieking, KFerandin, YKnockaert, MMeijer, LKunick, C Development of 5-benzylpaullones and paullone-9-carboxylic acid alkyl esters as selective inhibitors of mitochondrial malate dehydrogenase (mMDH). Eur J Med Chem45:335-42 (2010) 
 
Malate dehydrogenase, mitochondrial
Name:Malate dehydrogenase, mitochondrial
Type:PROTEIN
Mol. Mass.:35512.45
Organism:Homo sapiens (Human)
Description:ChEMBL_1456625
Residue:338
BDBM50300046
NameBDBM50300046
Synonyms:CHEMBL583199 | Pentyl 6-oxo-5,6,7,12-tetrahydroindolo[3,2-d][1]benzazepine-9-carboxylate
TypeSmall organic molecule
Emp. Form.C22H22N2O3
Mol. Mass.362.4217
SMILESCCCCCOC(=O)c1ccc2[nH]c-3c(CC(=O)Nc4ccccc-34)c2c1