Reaction Details
TargetGlycogen synthase kinase-3 beta
LigandBDBM7322
Substrate/Competitorn/a
Meas. Tech.ChEMBL_593421 (CHEMBL1040549)
IC50 18±n/a nM
Citation Becker, AKohfeld, SLader, APreu, LPies, TWieking, KFerandin, YKnockaert, MMeijer, LKunick, C Development of 5-benzylpaullones and paullone-9-carboxylic acid alkyl esters as selective inhibitors of mitochondrial malate dehydrogenase (mMDH). Eur J Med Chem45:335-42 (2010) 
 
Glycogen synthase kinase-3 beta
Name:Glycogen synthase kinase-3 beta
Type:Enzyme
Mol. Mass.:46756.38
Organism:Homo sapiens (Human)
Description:P49841
Residue:420
BDBM7322
NameBDBM7322
Synonyms:14-bromo-5-hydroxy-8,18-diazatetracyclo[9.7.0.0^{2,7}.0^{12,17}]octadeca-1(11),2,4,6,12(17),13,15-heptaen-9-one Paullone Analogue 57
TypeSmall organic molecule
Emp. Form.C16H11BrN2O2
Mol. Mass.343.175
SMILESOc1ccc2-c3[nH]c4ccc(Br)cc4c3CC(=O)Nc2c1