Reaction Details
TargetGlycogen synthase kinase-3 beta
LigandBDBM50300062
Substrate/Competitorn/a
Meas. Tech.ChEMBL_593421 (CHEMBL1040549)
IC50 15±n/a nM
Citation Becker, AKohfeld, SLader, APreu, LPies, TWieking, KFerandin, YKnockaert, MMeijer, LKunick, C Development of 5-benzylpaullones and paullone-9-carboxylic acid alkyl esters as selective inhibitors of mitochondrial malate dehydrogenase (mMDH). Eur J Med Chem45:335-42 (2010) 
 
Glycogen synthase kinase-3 beta
Name:Glycogen synthase kinase-3 beta
Type:Enzyme
Mol. Mass.:46756.38
Organism:Homo sapiens (Human)
Description:P49841
Residue:420
BDBM50300062
NameBDBM50300062
Synonyms:9-Bromo-2-methoxy-5,12-dihydro-7H-benzo[2,3]azepino[4,5-b]indol-6-one | CHEMBL575138
TypeSmall organic molecule
Emp. Form.C17H13BrN2O2
Mol. Mass.357.201
SMILESCOc1ccc2NC(=O)Cc3c([nH]c4ccc(Br)cc34)-c2c1