Reaction Details
TargetPolyphenol oxidase 2
LigandBDBM50300123
Substrate/Competitorn/a
Meas. Tech.ChEMBL_593679 (CHEMBL1044132)
Ki 36800±n/a nM
Citation Yi, WCao, RPeng, WWen, HYan, QZhou, BMa, LSong, H Synthesis and biological evaluation of novel 4-hydroxybenzaldehyde derivatives as tyrosinase inhibitors. Eur J Med Chem45:639-46 (2010) 
 
Polyphenol oxidase 2
Name:Polyphenol oxidase 2
Type:Protein
Mol. Mass.:63923.66
Organism:Agaricus bisporus (Common mushroom)
Description:O42713
Residue:556
BDBM50300123
NameBDBM50300123
Synonyms:2-(4-Formylphenoxy)ethyl dimethyl phosphate | CHEMBL574442
TypeSmall organic molecule
Emp. Form.C11H15O6P
Mol. Mass.274.207
SMILESCOP(=O)(OC)OCCOc1ccc(C=O)cc1