Reaction Details
TargetCarbonic anhydrase 1
LigandBDBM10888
Substrate/Competitorn/a
Meas. Tech.ChEMBL_592883 (CHEMBL1046628)
Ki 56±n/a nM
Citation Temperini, CInnocenti, AScozzafava, AParkkila, SSupuran, CT The coumarin-binding site in carbonic anhydrase accommodates structurally diverse inhibitors: the antiepileptic lacosamide as an example and lead molecule for novel classes of carbonic anhydrase inhibitors. J Med Chem53:850-4 (2010) 
 
Carbonic anhydrase 1
Name:Carbonic anhydrase 1
Type:Enzyme
Mol. Mass.:28873.37
Organism:Homo sapiens (Human)
Description:P00915
Residue:261
BDBM10888
NameBDBM10888
Synonyms:1,2-benzoxazol-3-ylmethanesulfonamide SPR_2 Zonisamide Zonisamide (ZNS) Zonisamide, ZNS
TypeSmall organic molecule
Emp. Form.C8H8N2O3S
Mol. Mass.212.226
SMILESNS(=O)(=O)Cc1noc2ccccc12