Reaction Details
TargetCarbonic anhydrase 6
LigandBDBM50300204
Substrate/Competitorn/a
Meas. Tech.ChEMBL_592889 (CHEMBL1046634)
Ki 412±n/a nM
Citation Temperini, CInnocenti, AScozzafava, AParkkila, SSupuran, CT The coumarin-binding site in carbonic anhydrase accommodates structurally diverse inhibitors: the antiepileptic lacosamide as an example and lead molecule for novel classes of carbonic anhydrase inhibitors. J Med Chem53:850-4 (2010) 
 
Carbonic anhydrase 6
Name:Carbonic anhydrase 6
Type:Enzyme
Mol. Mass.:35371.40
Organism:Homo sapiens (Human)
Description:P23280
Residue:308
BDBM50300204
NameBDBM50300204
Synonyms:(2R)-2-acetylamino-N-benzyl-3-methoxypropanamide (R)-2-acetamido-N-benzyl-3-methoxypropanamide (R)-N-benzyl 2-acetamido-3-methoxypropionamide, Erlosamide | LACOSAMIDE
TypeSmall organic molecule
Emp. Form.C13H18N2O3
Mol. Mass.250.2936
SMILESCOC[C@@H](NC(C)=O)C(=O)NCc1ccccc1