Reaction Details
TargetDisintegrin and metalloproteinase domain-containing protein 10
LigandBDBM50301103
Substrate/Competitorn/a
Meas. Tech.ChEMBL_598554 (CHEMBL1043546)
IC50 17±n/a nM
Citation Li, YLShi, EBurns, DLi, YCovington, MBPan, MScherle, PFriedman, SMetcalf, BYao, W Discovery of novel selective HER-2 sheddase inhibitors through optimization of P1 moiety. Bioorg Med Chem Lett19:5037-42 (2009) 
 
Disintegrin and metalloproteinase domain-containing protein 10
Name:Disintegrin and metalloproteinase domain-containing protein 10
Type:Enzyme
Mol. Mass.:84160.93
Organism:Homo sapiens (Human)
Description:O14672
Residue:748
BDBM50301103
NameBDBM50301103
Synonyms:(2S,3S)-N-hydroxy-5-(2-oxo-2-(pyrrolidin-1-yl)ethyl)-2-(4-phenyl-1,2,3,6-tetrahydropyridine-1-carbonyl)piperidine-3-carboxamide | CHEMBL569166
TypeSmall organic molecule
Emp. Form.C24H32N4O4
Mol. Mass.440.5353
SMILESONC(=O)[C@H]1CC(CC(=O)N2CCCC2)CN[C@@H]1C(=O)N1CCC(=CC1)c1ccccc1