Reaction Details
TargetProtein-tyrosine kinase 2-beta
LigandBDBM50301364
Substrate/Competitorn/a
Meas. Tech.ChEMBL_599548 (CHEMBL1037543)
EC50 10±n/a nM
Citation Allen, JGLee, MRHan, CYScherrer, JFlynn, SBoucher, CZhao, HO'Connor, ABRoveto, PBauer, DGraceffa, RRichards, WGBabij, P Identification of small molecule inhibitors of proline-rich tyrosine kinase 2 (Pyk2) with osteogenic activity in osteoblast cells. Bioorg Med Chem Lett19:4924-8 (2009) 
 
Protein-tyrosine kinase 2-beta
Name:Protein-tyrosine kinase 2-beta
Type:PROTEIN
Mol. Mass.:115790.07
Organism:Mus musculus
Description:ChEMBL_885497
Residue:1009
BDBM50301364
NameBDBM50301364
Synonyms:CHEMBL570380 | N-(5-(6,7-dimethoxyquinolin-4-yloxy)pyridin-2-yl)-2-oxo-1-phenyl-5-(thiophen-2-yl)-1,2-dihydropyridine-3-carboxamide
TypeSmall organic molecule
Emp. Form.C32H24N4O5S
Mol. Mass.576.622
SMILESCOc1cc2nccc(Oc3ccc(NC(=O)c4cc(cn(-c5ccccc5)c4=O)-c4cccs4)nc3)c2cc1OC