Reaction Details
TargetProtein-tyrosine kinase 2-beta
LigandBDBM50301361
Substrate/Competitorn/a
Meas. Tech.ChEMBL_599543 (CHEMBL1037538)
IC50 1500±n/a nM
Citation Allen, JGLee, MRHan, CYScherrer, JFlynn, SBoucher, CZhao, HO'Connor, ABRoveto, PBauer, DGraceffa, RRichards, WGBabij, P Identification of small molecule inhibitors of proline-rich tyrosine kinase 2 (Pyk2) with osteogenic activity in osteoblast cells. Bioorg Med Chem Lett19:4924-8 (2009) 
 
Protein-tyrosine kinase 2-beta
Name:Protein-tyrosine kinase 2-beta
Type:Protein
Mol. Mass.:115868.80
Organism:Homo sapiens (Human)
Description:Q14289
Residue:1009
BDBM50301361
NameBDBM50301361
Synonyms:CHEMBL570647 | N-(5-(6,7-dimethoxyquinolin-4-yloxy)pyridin-2-yl)-2-oxo-1-phenyl-4-(phenylamino)-1,2-dihydropyridine-3-carboxamide
TypeSmall organic molecule
Emp. Form.C34H27N5O5
Mol. Mass.585.6087
SMILESCOc1cc2nccc(Oc3ccc(NC(=O)c4c(Nc5ccccc5)ccn(-c5ccccc5)c4=O)nc3)c2cc1OC