Reaction Details
TargetProtein-tyrosine kinase 2-beta
LigandBDBM50301367
Substrate/Competitorn/a
Meas. Tech.ChEMBL_599543 (CHEMBL1037538)
IC50 430±n/a nM
Citation Allen, JGLee, MRHan, CYScherrer, JFlynn, SBoucher, CZhao, HO'Connor, ABRoveto, PBauer, DGraceffa, RRichards, WGBabij, P Identification of small molecule inhibitors of proline-rich tyrosine kinase 2 (Pyk2) with osteogenic activity in osteoblast cells. Bioorg Med Chem Lett19:4924-8 (2009) 
 
Protein-tyrosine kinase 2-beta
Name:Protein-tyrosine kinase 2-beta
Type:Protein
Mol. Mass.:115868.80
Organism:Homo sapiens (Human)
Description:Q14289
Residue:1009
BDBM50301367
NameBDBM50301367
Synonyms:CHEMBL570381 | N-(5-(7-methoxyquinolin-4-yloxy)pyridin-2-yl)-2-oxo-1-phenyl-5-(pyridin-3-yl)-1,2-dihydropyridine-3-carboxamide
TypeSmall organic molecule
Emp. Form.C32H23N5O4
Mol. Mass.541.5561
SMILESCOc1ccc2c(Oc3ccc(NC(=O)c4cc(cn(-c5ccccc5)c4=O)-c4cccnc4)nc3)ccnc2c1