Reaction Details
TargetFocal adhesion kinase 1
LigandBDBM50301357
Substrate/Competitorn/a
Meas. Tech.ChEMBL_599544 (CHEMBL1037539)
IC50>125000±n/a nM
Citation Allen, JGLee, MRHan, CYScherrer, JFlynn, SBoucher, CZhao, HO'Connor, ABRoveto, PBauer, DGraceffa, RRichards, WGBabij, P Identification of small molecule inhibitors of proline-rich tyrosine kinase 2 (Pyk2) with osteogenic activity in osteoblast cells. Bioorg Med Chem Lett19:4924-8 (2009) 
 
Focal adhesion kinase 1
Name:Focal adhesion kinase 1
Type:Tyrosine-protein kinase
Mol. Mass.:119233.17
Organism:Homo sapiens (Human)
Description:Q05397
Residue:1052
BDBM50301357
NameBDBM50301357
Synonyms:CHEMBL572237 | N-(5-(6,7-dimethoxyquinolin-4-yloxy)pyridin-2-yl)-4-(dimethylamino)-2-oxo-1-phenyl-1,2-dihydropyridine-3-carboxamide
TypeSmall organic molecule
Emp. Form.C30H27N5O5
Mol. Mass.537.5659
SMILESCOc1cc2nccc(Oc3ccc(NC(=O)c4c(ccn(-c5ccccc5)c4=O)N(C)C)nc3)c2cc1OC