Reaction Details
TargetFocal adhesion kinase 1
LigandBDBM50301359
Substrate/Competitorn/a
Meas. Tech.ChEMBL_599544 (CHEMBL1037539)
IC50 1300±n/a nM
Citation Allen, JGLee, MRHan, CYScherrer, JFlynn, SBoucher, CZhao, HO'Connor, ABRoveto, PBauer, DGraceffa, RRichards, WGBabij, P Identification of small molecule inhibitors of proline-rich tyrosine kinase 2 (Pyk2) with osteogenic activity in osteoblast cells. Bioorg Med Chem Lett19:4924-8 (2009) 
 
Focal adhesion kinase 1
Name:Focal adhesion kinase 1
Type:Tyrosine-protein kinase
Mol. Mass.:119233.17
Organism:Homo sapiens (Human)
Description:Q05397
Residue:1052
BDBM50301359
NameBDBM50301359
Synonyms:CHEMBL570846 | N-(5-(6,7-dimethoxyquinolin-4-yloxy)pyridin-2-yl)-2-oxo-1-phenyl-4-(tetrahydro-2H-pyran-4-ylamino)-1,2-dihydropyridine-3-carboxamide
TypeSmall organic molecule
Emp. Form.C33H31N5O6
Mol. Mass.593.6291
SMILESCOc1cc2nccc(Oc3ccc(NC(=O)c4c(NC5CCOCC5)ccn(-c5ccccc5)c4=O)nc3)c2cc1OC